﻿Domain name,Display name,Keyword,Tags,Country,Search engine,Location,Desktop,Mobile,Ignore local,Ignore featured snippet,Ignore in share of voice,Description,Preferred URL,Enable autocorrection,Starred,Date,Rank,URL
leach.info,leach,apply,"politics,yard,feel",en-mv,Google,Kellyton,True,False,True,True,False,Everyone you before want evening grow.,https://leach.info/explore/list,False,False,2022-02-16,47,https://leach.info/tag/tag
leach.info,leach,apply,"politics,yard,feel",en-mv,Google,Kellyton,True,False,True,True,False,Everyone you before want evening grow.,https://leach.info/explore/list,False,False,2022-02-15,42,https://leach.info/blog/search/main
leach.info,leach,apply,"politics,yard,feel",en-mv,Google,Kellyton,True,False,True,True,False,Everyone you before want evening grow.,https://leach.info/explore/list,False,False,2022-02-14,46,https://leach.info/category
leach.info,leach,apply,"politics,yard,feel",en-mv,Google,Kellyton,True,False,True,True,False,Everyone you before want evening grow.,https://leach.info/explore/list,False,False,2022-02-13,48,https://leach.info/wp-content/wp-content/blog
leach.info,leach,apply,"politics,yard,feel",en-mv,Google,Kellyton,True,False,True,True,False,Everyone you before want evening grow.,https://leach.info/explore/list,False,False,2022-02-12,50,https://leach.info/list/app/category
leach.info,leach,apply,"politics,yard,feel",en-mv,Google,Kellyton,True,False,True,True,False,Everyone you before want evening grow.,https://leach.info/explore/list,False,False,2022-02-11,49,https://leach.info/posts/wp-content/wp-content
leach.info,leach,apply,"politics,yard,feel",en-mv,Google,Kellyton,True,False,True,True,False,Everyone you before want evening grow.,https://leach.info/explore/list,False,False,2022-02-10,57,https://leach.info/wp-content/posts
leach.info,leach,apply,"politics,yard,feel",en-mv,Google,Kellyton,True,False,True,True,False,Everyone you before want evening grow.,https://leach.info/explore/list,False,False,2022-02-09,66,https://leach.info/list/list/explore
leach.info,leach,apply,"politics,yard,feel",en-mv,Google,Kellyton,True,False,True,True,False,Everyone you before want evening grow.,https://leach.info/explore/list,False,False,2022-02-08,68,https://leach.info/category/posts/list
leach.info,leach,apply,"politics,yard,feel",en-mv,Google,Kellyton,True,False,True,True,False,Everyone you before want evening grow.,https://leach.info/explore/list,False,False,2022-02-07,74,https://leach.info/category
leach.info,leach,apply,"politics,yard,feel",en-mv,Google,Kellyton,True,False,True,True,False,Everyone you before want evening grow.,https://leach.info/explore/list,False,False,2022-02-06,73,https://leach.info/app/category
leach.info,leach,apply,"politics,yard,feel",en-mv,Google,Kellyton,True,False,True,True,False,Everyone you before want evening grow.,https://leach.info/explore/list,False,False,2022-02-05,79,https://leach.info/main/wp-content
leach.info,leach,apply,"politics,yard,feel",en-mv,Google,Kellyton,True,False,True,True,False,Everyone you before want evening grow.,https://leach.info/explore/list,False,False,2022-02-04,80,https://leach.info/blog/posts
leach.info,leach,apply,"politics,yard,feel",en-mv,Google,Kellyton,True,False,True,True,False,Everyone you before want evening grow.,https://leach.info/explore/list,False,False,2022-02-03,88,https://leach.info/main/tags
leach.info,leach,apply,"politics,yard,feel",en-mv,Google,Kellyton,True,False,True,True,False,Everyone you before want evening grow.,https://leach.info/explore/list,False,False,2022-02-02,90,https://leach.info/search/main
leach.info,leach,apply,"politics,yard,feel",en-mv,Google,Kellyton,True,False,True,True,False,Everyone you before want evening grow.,https://leach.info/explore/list,False,False,2022-02-01,94,https://leach.info/search/tag
leach.info,leach,apply,"politics,yard,feel",en-mv,Google,Kellyton,True,False,True,True,False,Everyone you before want evening grow.,https://leach.info/explore/list,False,False,2022-01-31,,
leach.info,leach,apply,"politics,yard,feel",en-mv,Google,Kellyton,True,False,True,True,False,Everyone you before want evening grow.,https://leach.info/explore/list,False,False,2022-01-30,,
leach.info,leach,apply,"politics,yard,feel",en-mv,Google,Kellyton,True,False,True,True,False,Everyone you before want evening grow.,https://leach.info/explore/list,False,False,2022-01-29,96,https://leach.info/app/category/posts
leach.info,leach,apply,"politics,yard,feel",en-mv,Google,Kellyton,True,False,True,True,False,Everyone you before want evening grow.,https://leach.info/explore/list,False,False,2022-01-28,99,https://leach.info/wp-content/wp-content
leach.info,leach,apply,"politics,yard,feel",en-mv,Google,Kellyton,True,False,True,True,False,Everyone you before want evening grow.,https://leach.info/explore/list,False,False,2022-01-27,95,https://leach.info/explore/blog
leach.info,leach,apply,"politics,yard,feel",en-mv,Google,Kellyton,True,False,True,True,False,Everyone you before want evening grow.,https://leach.info/explore/list,False,False,2022-01-26,90,https://leach.info/tag/category
leach.info,leach,apply,"politics,yard,feel",en-mv,Google,Kellyton,True,False,True,True,False,Everyone you before want evening grow.,https://leach.info/explore/list,False,False,2022-01-25,97,https://leach.info/list/categories/categories
leach.info,leach,apply,"politics,yard,feel",en-mv,Google,Kellyton,True,False,True,True,False,Everyone you before want evening grow.,https://leach.info/explore/list,False,False,2022-01-24,95,https://leach.info/list
leach.info,leach,apply,"politics,yard,feel",en-mv,Google,Kellyton,True,False,True,True,False,Everyone you before want evening grow.,https://leach.info/explore/list,False,False,2022-01-23,93,https://leach.info/tag
leach.info,leach,apply,"politics,yard,feel",en-mv,Google,Kellyton,True,False,True,True,False,Everyone you before want evening grow.,https://leach.info/explore/list,False,False,2022-01-22,91,https://leach.info/tag
leach.info,leach,apply,"politics,yard,feel",en-mv,Google,Kellyton,True,False,True,True,False,Everyone you before want evening grow.,https://leach.info/explore/list,False,False,2022-01-21,91,https://leach.info/wp-content/search
leach.info,leach,apply,"politics,yard,feel",en-mv,Google,Kellyton,True,False,True,True,False,Everyone you before want evening grow.,https://leach.info/explore/list,False,False,2022-01-20,91,https://leach.info/search/posts/search
leach.info,leach,apply,"politics,yard,feel",en-mv,Google,Kellyton,True,False,True,True,False,Everyone you before want evening grow.,https://leach.info/explore/list,False,False,2022-01-19,95,https://leach.info/main/search/blog
leach.info,leach,apply,"politics,yard,feel",en-mv,Google,Kellyton,True,False,True,True,False,Everyone you before want evening grow.,https://leach.info/explore/list,False,False,2022-01-18,90,https://leach.info/categories/explore/category
davis.com,davis,walk,"budget,medical,ask",zh-cn,Baidu,Alvarezberg,True,False,,,True,Enough trip future.,https://davis.com/tags/posts,,True,2022-02-16,41,https://davis.com/posts
davis.com,davis,walk,"budget,medical,ask",zh-cn,Baidu,Alvarezberg,True,False,,,True,Enough trip future.,https://davis.com/tags/posts,,True,2022-02-15,38,https://davis.com/app/tag/search
davis.com,davis,walk,"budget,medical,ask",zh-cn,Baidu,Alvarezberg,True,False,,,True,Enough trip future.,https://davis.com/tags/posts,,True,2022-02-14,48,https://davis.com/categories/tag/main
davis.com,davis,walk,"budget,medical,ask",zh-cn,Baidu,Alvarezberg,True,False,,,True,Enough trip future.,https://davis.com/tags/posts,,True,2022-02-13,50,https://davis.com/posts
davis.com,davis,walk,"budget,medical,ask",zh-cn,Baidu,Alvarezberg,True,False,,,True,Enough trip future.,https://davis.com/tags/posts,,True,2022-02-12,53,https://davis.com/main/categories
davis.com,davis,walk,"budget,medical,ask",zh-cn,Baidu,Alvarezberg,True,False,,,True,Enough trip future.,https://davis.com/tags/posts,,True,2022-02-11,50,https://davis.com/categories/explore/search
davis.com,davis,walk,"budget,medical,ask",zh-cn,Baidu,Alvarezberg,True,False,,,True,Enough trip future.,https://davis.com/tags/posts,,True,2022-02-10,48,https://davis.com/categories/tag/tags
davis.com,davis,walk,"budget,medical,ask",zh-cn,Baidu,Alvarezberg,True,False,,,True,Enough trip future.,https://davis.com/tags/posts,,True,2022-02-09,45,https://davis.com/category
davis.com,davis,walk,"budget,medical,ask",zh-cn,Baidu,Alvarezberg,True,False,,,True,Enough trip future.,https://davis.com/tags/posts,,True,2022-02-08,40,https://davis.com/app
davis.com,davis,walk,"budget,medical,ask",zh-cn,Baidu,Alvarezberg,True,False,,,True,Enough trip future.,https://davis.com/tags/posts,,True,2022-02-07,38,https://davis.com/app
davis.com,davis,walk,"budget,medical,ask",zh-cn,Baidu,Alvarezberg,True,False,,,True,Enough trip future.,https://davis.com/tags/posts,,True,2022-02-06,37,https://davis.com/explore/explore/category
davis.com,davis,walk,"budget,medical,ask",zh-cn,Baidu,Alvarezberg,True,False,,,True,Enough trip future.,https://davis.com/tags/posts,,True,2022-02-05,34,https://davis.com/main
davis.com,davis,walk,"budget,medical,ask",zh-cn,Baidu,Alvarezberg,True,False,,,True,Enough trip future.,https://davis.com/tags/posts,,True,2022-02-04,38,https://davis.com/blog/wp-content
davis.com,davis,walk,"budget,medical,ask",zh-cn,Baidu,Alvarezberg,True,False,,,True,Enough trip future.,https://davis.com/tags/posts,,True,2022-02-03,43,https://davis.com/explore/app
davis.com,davis,walk,"budget,medical,ask",zh-cn,Baidu,Alvarezberg,True,False,,,True,Enough trip future.,https://davis.com/tags/posts,,True,2022-02-02,49,https://davis.com/tags/categories/wp-content
davis.com,davis,walk,"budget,medical,ask",zh-cn,Baidu,Alvarezberg,True,False,,,True,Enough trip future.,https://davis.com/tags/posts,,True,2022-02-01,50,https://davis.com/tag/explore
davis.com,davis,walk,"budget,medical,ask",zh-cn,Baidu,Alvarezberg,True,False,,,True,Enough trip future.,https://davis.com/tags/posts,,True,2022-01-31,53,https://davis.com/category/app/main
davis.com,davis,walk,"budget,medical,ask",zh-cn,Baidu,Alvarezberg,True,False,,,True,Enough trip future.,https://davis.com/tags/posts,,True,2022-01-30,53,https://davis.com/app
davis.com,davis,walk,"budget,medical,ask",zh-cn,Baidu,Alvarezberg,True,False,,,True,Enough trip future.,https://davis.com/tags/posts,,True,2022-01-29,58,https://davis.com/explore/explore/tags
davis.com,davis,walk,"budget,medical,ask",zh-cn,Baidu,Alvarezberg,True,False,,,True,Enough trip future.,https://davis.com/tags/posts,,True,2022-01-28,59,https://davis.com/wp-content/list/main
davis.com,davis,walk,"budget,medical,ask",zh-cn,Baidu,Alvarezberg,True,False,,,True,Enough trip future.,https://davis.com/tags/posts,,True,2022-01-27,68,https://davis.com/search
davis.com,davis,walk,"budget,medical,ask",zh-cn,Baidu,Alvarezberg,True,False,,,True,Enough trip future.,https://davis.com/tags/posts,,True,2022-01-26,75,https://davis.com/categories
davis.com,davis,walk,"budget,medical,ask",zh-cn,Baidu,Alvarezberg,True,False,,,True,Enough trip future.,https://davis.com/tags/posts,,True,2022-01-25,74,https://davis.com/posts/explore
davis.com,davis,walk,"budget,medical,ask",zh-cn,Baidu,Alvarezberg,True,False,,,True,Enough trip future.,https://davis.com/tags/posts,,True,2022-01-24,81,https://davis.com/explore
davis.com,davis,walk,"budget,medical,ask",zh-cn,Baidu,Alvarezberg,True,False,,,True,Enough trip future.,https://davis.com/tags/posts,,True,2022-01-23,88,https://davis.com/search/explore/categories
davis.com,davis,walk,"budget,medical,ask",zh-cn,Baidu,Alvarezberg,True,False,,,True,Enough trip future.,https://davis.com/tags/posts,,True,2022-01-22,95,https://davis.com/tag
davis.com,davis,walk,"budget,medical,ask",zh-cn,Baidu,Alvarezberg,True,False,,,True,Enough trip future.,https://davis.com/tags/posts,,True,2022-01-21,96,https://davis.com/main/posts/search
davis.com,davis,walk,"budget,medical,ask",zh-cn,Baidu,Alvarezberg,True,False,,,True,Enough trip future.,https://davis.com/tags/posts,,True,2022-01-20,,
davis.com,davis,walk,"budget,medical,ask",zh-cn,Baidu,Alvarezberg,True,False,,,True,Enough trip future.,https://davis.com/tags/posts,,True,2022-01-19,,
davis.com,davis,walk,"budget,medical,ask",zh-cn,Baidu,Alvarezberg,True,False,,,True,Enough trip future.,https://davis.com/tags/posts,,True,2022-01-18,,
carroll-young.com,carroll-young,role,"because,management,low",fr-gp,YouTube,Powersside,True,False,,,False,Actually effect writer win.,https://carroll-young.com/posts/tag,,False,2022-02-16,18,https://carroll-young.com/search/category/explore
carroll-young.com,carroll-young,role,"because,management,low",fr-gp,YouTube,Powersside,True,False,,,False,Actually effect writer win.,https://carroll-young.com/posts/tag,,False,2022-02-15,20,https://carroll-young.com/main/main/search
carroll-young.com,carroll-young,role,"because,management,low",fr-gp,YouTube,Powersside,True,False,,,False,Actually effect writer win.,https://carroll-young.com/posts/tag,,False,2022-02-14,22,https://carroll-young.com/app
carroll-young.com,carroll-young,role,"because,management,low",fr-gp,YouTube,Powersside,True,False,,,False,Actually effect writer win.,https://carroll-young.com/posts/tag,,False,2022-02-13,24,https://carroll-young.com/posts/category
carroll-young.com,carroll-young,role,"because,management,low",fr-gp,YouTube,Powersside,True,False,,,False,Actually effect writer win.,https://carroll-young.com/posts/tag,,False,2022-02-12,28,https://carroll-young.com/blog/list/main
carroll-young.com,carroll-young,role,"because,management,low",fr-gp,YouTube,Powersside,True,False,,,False,Actually effect writer win.,https://carroll-young.com/posts/tag,,False,2022-02-11,30,https://carroll-young.com/blog/app/search
carroll-young.com,carroll-young,role,"because,management,low",fr-gp,YouTube,Powersside,True,False,,,False,Actually effect writer win.,https://carroll-young.com/posts/tag,,False,2022-02-10,36,https://carroll-young.com/tags
carroll-young.com,carroll-young,role,"because,management,low",fr-gp,YouTube,Powersside,True,False,,,False,Actually effect writer win.,https://carroll-young.com/posts/tag,,False,2022-02-09,41,https://carroll-young.com/search/posts
carroll-young.com,carroll-young,role,"because,management,low",fr-gp,YouTube,Powersside,True,False,,,False,Actually effect writer win.,https://carroll-young.com/posts/tag,,False,2022-02-08,41,https://carroll-young.com/tag/list/tag
carroll-young.com,carroll-young,role,"because,management,low",fr-gp,YouTube,Powersside,True,False,,,False,Actually effect writer win.,https://carroll-young.com/posts/tag,,False,2022-02-07,42,https://carroll-young.com/tag
carroll-young.com,carroll-young,role,"because,management,low",fr-gp,YouTube,Powersside,True,False,,,False,Actually effect writer win.,https://carroll-young.com/posts/tag,,False,2022-02-06,50,https://carroll-young.com/explore
carroll-young.com,carroll-young,role,"because,management,low",fr-gp,YouTube,Powersside,True,False,,,False,Actually effect writer win.,https://carroll-young.com/posts/tag,,False,2022-02-05,59,https://carroll-young.com/tag/list/category
carroll-young.com,carroll-young,role,"because,management,low",fr-gp,YouTube,Powersside,True,False,,,False,Actually effect writer win.,https://carroll-young.com/posts/tag,,False,2022-02-04,59,https://carroll-young.com/tag/tags/app
carroll-young.com,carroll-young,role,"because,management,low",fr-gp,YouTube,Powersside,True,False,,,False,Actually effect writer win.,https://carroll-young.com/posts/tag,,False,2022-02-03,55,https://carroll-young.com/wp-content/blog/main
carroll-young.com,carroll-young,role,"because,management,low",fr-gp,YouTube,Powersside,True,False,,,False,Actually effect writer win.,https://carroll-young.com/posts/tag,,False,2022-02-02,59,https://carroll-young.com/category
carroll-young.com,carroll-young,role,"because,management,low",fr-gp,YouTube,Powersside,True,False,,,False,Actually effect writer win.,https://carroll-young.com/posts/tag,,False,2022-02-01,66,https://carroll-young.com/blog/search/category
carroll-young.com,carroll-young,role,"because,management,low",fr-gp,YouTube,Powersside,True,False,,,False,Actually effect writer win.,https://carroll-young.com/posts/tag,,False,2022-01-31,73,https://carroll-young.com/list/list/tags
carroll-young.com,carroll-young,role,"because,management,low",fr-gp,YouTube,Powersside,True,False,,,False,Actually effect writer win.,https://carroll-young.com/posts/tag,,False,2022-01-30,80,https://carroll-young.com/categories/category/search
carroll-young.com,carroll-young,role,"because,management,low",fr-gp,YouTube,Powersside,True,False,,,False,Actually effect writer win.,https://carroll-young.com/posts/tag,,False,2022-01-29,79,https://carroll-young.com/main/main
carroll-young.com,carroll-young,role,"because,management,low",fr-gp,YouTube,Powersside,True,False,,,False,Actually effect writer win.,https://carroll-young.com/posts/tag,,False,2022-01-28,89,https://carroll-young.com/list
carroll-young.com,carroll-young,role,"because,management,low",fr-gp,YouTube,Powersside,True,False,,,False,Actually effect writer win.,https://carroll-young.com/posts/tag,,False,2022-01-27,98,https://carroll-young.com/main
carroll-young.com,carroll-young,role,"because,management,low",fr-gp,YouTube,Powersside,True,False,,,False,Actually effect writer win.,https://carroll-young.com/posts/tag,,False,2022-01-26,93,https://carroll-young.com/tags/list/posts
carroll-young.com,carroll-young,role,"because,management,low",fr-gp,YouTube,Powersside,True,False,,,False,Actually effect writer win.,https://carroll-young.com/posts/tag,,False,2022-01-25,92,https://carroll-young.com/category/categories
carroll-young.com,carroll-young,role,"because,management,low",fr-gp,YouTube,Powersside,True,False,,,False,Actually effect writer win.,https://carroll-young.com/posts/tag,,False,2022-01-24,96,https://carroll-young.com/tag/posts/blog
carroll-young.com,carroll-young,role,"because,management,low",fr-gp,YouTube,Powersside,True,False,,,False,Actually effect writer win.,https://carroll-young.com/posts/tag,,False,2022-01-23,91,https://carroll-young.com/explore/explore/category
carroll-young.com,carroll-young,role,"because,management,low",fr-gp,YouTube,Powersside,True,False,,,False,Actually effect writer win.,https://carroll-young.com/posts/tag,,False,2022-01-22,,
carroll-young.com,carroll-young,role,"because,management,low",fr-gp,YouTube,Powersside,True,False,,,False,Actually effect writer win.,https://carroll-young.com/posts/tag,,False,2022-01-21,,
carroll-young.com,carroll-young,role,"because,management,low",fr-gp,YouTube,Powersside,True,False,,,False,Actually effect writer win.,https://carroll-young.com/posts/tag,,False,2022-01-20,,
carroll-young.com,carroll-young,role,"because,management,low",fr-gp,YouTube,Powersside,True,False,,,False,Actually effect writer win.,https://carroll-young.com/posts/tag,,False,2022-01-19,97,https://carroll-young.com/blog/main
carroll-young.com,carroll-young,role,"because,management,low",fr-gp,YouTube,Powersside,True,False,,,False,Actually effect writer win.,https://carroll-young.com/posts/tag,,False,2022-01-18,95,https://carroll-young.com/list/posts
martin.info,martin,memory,"list,activity,work",sv-se,YouTube,New Barrybury,False,False,,,True,Court year happy chair use party.,https://martin.info/explore/blog,,True,2022-02-16,45,https://martin.info/tag/tag/posts
martin.info,martin,memory,"list,activity,work",sv-se,YouTube,New Barrybury,False,False,,,True,Court year happy chair use party.,https://martin.info/explore/blog,,True,2022-02-15,46,https://martin.info/list/tags
martin.info,martin,memory,"list,activity,work",sv-se,YouTube,New Barrybury,False,False,,,True,Court year happy chair use party.,https://martin.info/explore/blog,,True,2022-02-14,55,https://martin.info/wp-content
martin.info,martin,memory,"list,activity,work",sv-se,YouTube,New Barrybury,False,False,,,True,Court year happy chair use party.,https://martin.info/explore/blog,,True,2022-02-13,65,https://martin.info/category
martin.info,martin,memory,"list,activity,work",sv-se,YouTube,New Barrybury,False,False,,,True,Court year happy chair use party.,https://martin.info/explore/blog,,True,2022-02-12,75,https://martin.info/search/category
martin.info,martin,memory,"list,activity,work",sv-se,YouTube,New Barrybury,False,False,,,True,Court year happy chair use party.,https://martin.info/explore/blog,,True,2022-02-11,82,https://martin.info/tags/wp-content/explore
martin.info,martin,memory,"list,activity,work",sv-se,YouTube,New Barrybury,False,False,,,True,Court year happy chair use party.,https://martin.info/explore/blog,,True,2022-02-10,81,https://martin.info/explore/explore
martin.info,martin,memory,"list,activity,work",sv-se,YouTube,New Barrybury,False,False,,,True,Court year happy chair use party.,https://martin.info/explore/blog,,True,2022-02-09,80,https://martin.info/tags/wp-content
martin.info,martin,memory,"list,activity,work",sv-se,YouTube,New Barrybury,False,False,,,True,Court year happy chair use party.,https://martin.info/explore/blog,,True,2022-02-08,80,https://martin.info/tag/app
martin.info,martin,memory,"list,activity,work",sv-se,YouTube,New Barrybury,False,False,,,True,Court year happy chair use party.,https://martin.info/explore/blog,,True,2022-02-07,87,https://martin.info/wp-content/list/explore
martin.info,martin,memory,"list,activity,work",sv-se,YouTube,New Barrybury,False,False,,,True,Court year happy chair use party.,https://martin.info/explore/blog,,True,2022-02-06,95,https://martin.info/blog
martin.info,martin,memory,"list,activity,work",sv-se,YouTube,New Barrybury,False,False,,,True,Court year happy chair use party.,https://martin.info/explore/blog,,True,2022-02-05,99,https://martin.info/categories/category
martin.info,martin,memory,"list,activity,work",sv-se,YouTube,New Barrybury,False,False,,,True,Court year happy chair use party.,https://martin.info/explore/blog,,True,2022-02-04,99,https://martin.info/app/search/posts
martin.info,martin,memory,"list,activity,work",sv-se,YouTube,New Barrybury,False,False,,,True,Court year happy chair use party.,https://martin.info/explore/blog,,True,2022-02-03,,
martin.info,martin,memory,"list,activity,work",sv-se,YouTube,New Barrybury,False,False,,,True,Court year happy chair use party.,https://martin.info/explore/blog,,True,2022-02-02,98,https://martin.info/categories
martin.info,martin,memory,"list,activity,work",sv-se,YouTube,New Barrybury,False,False,,,True,Court year happy chair use party.,https://martin.info/explore/blog,,True,2022-02-01,,
martin.info,martin,memory,"list,activity,work",sv-se,YouTube,New Barrybury,False,False,,,True,Court year happy chair use party.,https://martin.info/explore/blog,,True,2022-01-31,,
martin.info,martin,memory,"list,activity,work",sv-se,YouTube,New Barrybury,False,False,,,True,Court year happy chair use party.,https://martin.info/explore/blog,,True,2022-01-30,,
martin.info,martin,memory,"list,activity,work",sv-se,YouTube,New Barrybury,False,False,,,True,Court year happy chair use party.,https://martin.info/explore/blog,,True,2022-01-29,99,https://martin.info/search/wp-content/app
martin.info,martin,memory,"list,activity,work",sv-se,YouTube,New Barrybury,False,False,,,True,Court year happy chair use party.,https://martin.info/explore/blog,,True,2022-01-28,95,https://martin.info/app
martin.info,martin,memory,"list,activity,work",sv-se,YouTube,New Barrybury,False,False,,,True,Court year happy chair use party.,https://martin.info/explore/blog,,True,2022-01-27,,
martin.info,martin,memory,"list,activity,work",sv-se,YouTube,New Barrybury,False,False,,,True,Court year happy chair use party.,https://martin.info/explore/blog,,True,2022-01-26,,
martin.info,martin,memory,"list,activity,work",sv-se,YouTube,New Barrybury,False,False,,,True,Court year happy chair use party.,https://martin.info/explore/blog,,True,2022-01-25,94,https://martin.info/tag